Target
Replicase polyprotein 1ab
Ligand
BDBM50523946
Substrate
Meas. Tech.
ChEMBL_1891482 (CHEMBL4393309)
IC50
25000±n/a nM
Citation
 Lee, HRen, JPesavento, RPOjeda, IRice, AJLv, HKwon, YJohnson, ME Identification and design of novel small molecule inhibitors against MERS-CoV papain-like protease via high-throughput screening and molecular modeling. Bioorg Med Chem 27:1981-1989 (2019)  
Target
Name:
Replicase polyprotein 1ab
Synonyms:
2.1.1.- 3.1.-.- 3.4.19.12 3.4.22.69 3.6.4.13 3CL-PRO ExoN Growth factor-like peptide Hel Host translation inhibitor nsp1 NendoU Non-structural protein 2 Non-structural protein 4 Non-structural protein 7 Non-structural protein 9 PL-PRO Pol RNA-directed RNA polymerase Replicase polyprotein 1ab nsp1 nsp12 nsp14 nsp16 nsp3 nsp5 nsp7 nsp9 pp1ab | rep
Type:
PROTEIN
Mol. Mass.:
789589.93
Organism:
Middle East respiratory syndrome-related coronavirus (isolate UnitedKingdom/H123990006/2012) (Betacoronavirus England 1) (Humancoronavirus EMC)
Description:
ChEMBL_117802
Residue:
7078
  
Inhibitor
Name:
BDBM50523946
Synonyms:
ONO-1078
Type:
Small organic molecule
Emp. Form.:
C27H25N5O4
Mol. Mass.:
483.5185
SMILES:
O=C(NC1=CC=CC2C1OC(=CC2=O)c1nn[nH]n1)c1ccc(OCCCCc2ccccc2)cc1
: