Target
Adenosine kinase
Ligand
BDBM50524392
Substrate
Meas. Tech.
ChEMBL_1892973 (CHEMBL4394894)
Ki
19±n/a nM
Citation
 Crespo, RADang, QZhou, NEGuthrie, LMSnavely, TCDong, WLoesch, KASuzuki, TYou, LWang, WO'Malley, TParish, TOlsen, DBSacchettini, JC Structure-Guided Drug Design of 6-Substituted Adenosine Analogues as Potent Inhibitors of Mycobacterium tuberculosis Adenosine Kinase. J Med Chem 62:4483-4499 (2019)  
Target
Name:
Adenosine kinase
Synonyms:
2.7.1.20 ADOK_MYCTU adoK | cbhK
Type:
PROTEIN
Mol. Mass.:
34457.04
Organism:
Mycobacterium tuberculosis (strain ATCC 25618 / H37Rv)
Description:
ChEMBL_119021
Residue:
324
  
Inhibitor
Name:
BDBM50524392
Synonyms:
CHEMBL4475059
Type:
Small organic molecule
Emp. Form.:
C26H29N7O5
Mol. Mass.:
519.5524
SMILES:
COc1ccc(cn1)-c1ccc(cc1)N1CCN(CC1)c1ncnc2n(cnc12)[C@@H]1O[C@H](CO)[C@@H](O)[C@H]1O
: