Target
Acetylcholine receptor subunit epsilon
Ligand
BDBM50524704
Substrate
Meas. Tech.
ChEMBL_1894505 (CHEMBL4396426)
IC50
54700±n/a nM
Citation
 Huang, WLiang, MLi, QZheng, XZhang, CWang, QTang, LZhang, ZWang, BShen, Z Development of the "hidden" multifunctional agents for Alzheimer's disease. Eur J Med Chem 177:247-258 (2019)  
Target
Name:
Acetylcholine receptor subunit epsilon
Synonyms:
ACHE_RAT Achre | Chrne
Type:
PROTEIN
Mol. Mass.:
54930.09
Organism:
Rattus norvegicus
Description:
ChEMBL_1292388
Residue:
494
  
Inhibitor
Name:
BDBM50524704
Synonyms:
CHEMBL4446271
Type:
Small organic molecule
Emp. Form.:
C20H28N4O2
Mol. Mass.:
356.4619
SMILES:
CCN(C)C(=O)Oc1cc(cc2cccnc12)C(C)N1CCN(C)CC1
: