Target
Adenosine receptor A1
Ligand
BDBM50330250
Substrate
Meas. Tech.
ChEMBL_1896425 (CHEMBL4398460)
Ki
122±n/a nM
Citation
 Yang, SMao, YZhang, HXu, YAn, JHuang, Z The chemical biology of apoptosis: Revisited after 17 years. Eur J Med Chem 177:63-75 (2019)  
Target
Name:
Adenosine receptor A1
Synonyms:
A1 adenosine receptor (hA1) AA1R_HUMAN ADORA1 Adenosine A1-receptor Adenosine receptor A1 (hA1) | Adenosine transporter (AdT)
Type:
G Protein-Coupled Receptor (GPCR)
Mol. Mass.:
36520.92
Organism:
Homo sapiens (Human)
Description:
P30542
Residue:
326
  
Inhibitor
Name:
BDBM50330250
Synonyms:
5,5'-Dibenzyl-6,6',7,7'-tetrahydroxy-3,3'-dimethyl-2,2'-binaphthyl-1,1',4,4'-tetraone | CHEMBL1269107
Type:
Small organic molecule
Emp. Form.:
C36H26O8
Mol. Mass.:
586.5868
SMILES:
Oc1cc2c(O)c(-c3c(O)c4cc(O)c(O)c(=Cc5ccccc5)c4c(O)c3=C)c(=C)c(O)c2c(=Cc2ccccc2)c1O
: