Target
Induced myeloid leukemia cell differentiation protein Mcl-1
Ligand
BDBM50266967
Substrate
Meas. Tech.
ChEMBL_1896424 (CHEMBL4398459)
Ki
10±n/a nM
Citation
 Yang, SMao, YZhang, HXu, YAn, JHuang, Z The chemical biology of apoptosis: Revisited after 17 years. Eur J Med Chem 177:63-75 (2019)  
Target
Name:
Induced myeloid leukemia cell differentiation protein Mcl-1
Synonyms:
BCL2L3 Bcl-2-like protein 3 (Mcl-1) Bcl2-L-3 MCL1 Mcl-1 Myeloid cell leukemia sequence 1 (BCL2-related) | mcl1/EAT
Type:
Membrane; Single-pass membrane protein
Mol. Mass.:
37332.87
Organism:
Homo sapiens (Human)
Description:
Q07820
Residue:
350
  
Inhibitor
Name:
BDBM50266967
Synonyms:
CHEBI:66678 | CHEMBL3393621
Type:
Small organic molecule
Emp. Form.:
C22H12Cl4N2O4
Mol. Mass.:
510.154
SMILES:
Oc1ccccc1C(=O)c1[nH]c(Cl)c(Cl)c1-n1c(Cl)c(Cl)cc1C(=O)c1ccccc1O
: