Target
17-beta-hydroxysteroid dehydrogenase type 1
Ligand
BDBM50525963
Substrate
Meas. Tech.
ChEMBL_1898527 (CHEMBL4400642)
IC50
1.4±n/a nM
Citation
 Abdelsamie, ASHerath, SBiskupek, YBörger, CSiebenbürger, LSalah, MScheuer, CMarchais-Oberwinkler, SFrotscher, MPohlemann, TMenger, MDHartmann, RWLaschke, MWvan Koppen, CJ Targeted Endocrine Therapy: Design, Synthesis, and Proof-of-Principle of 17?-Hydroxysteroid Dehydrogenase Type 2 Inhibitors in Bone Fracture Healing. J Med Chem 62:1362-1372 (2019)  
Target
Name:
17-beta-hydroxysteroid dehydrogenase type 1
Synonyms:
17-beta-HSD 1 17-beta-hydroxysteroid dehydrogenase type 1 20-alpha-HSD E17KSR EDH17B1 EDHB17 Estradiol 17-beta-dehydrogenase 1 (17beta-HSD1) Placental 17-beta-hydroxysteroid dehydrogenase | SDR28C1
Type:
Enzyme
Mol. Mass.:
34945.13
Organism:
Homo sapiens (Human)
Description:
P14061
Residue:
328
  
Inhibitor
Name:
BDBM50525963
Synonyms:
CHEMBL4582194
Type:
Small organic molecule
Emp. Form.:
C23H15F2NO4S2
Mol. Mass.:
471.496
SMILES:
Oc1ccc(F)c(C(=O)c2ccc(s2)-c2cccc(NS(=O)(=O)c3ccccc3)c2)c1F
: