Target
Prothrombin
Ligand
BDBM50073429
Substrate
Meas. Tech.
ChEBML_207978
IC50
0.710000±n/a nM
Citation
 Tamura, SYGoldman, EABergum, PWSemple, JE Novel benzo-fused lactam scaffolds as factor Xa inhibitors. Bioorg Med Chem Lett 9:2573-8 (1999)  
Target
Name:
Prothrombin
Synonyms:
Activation peptide fragment 1 Coagulation factor II Prothrombin precursor Thrombin heavy chain | Thrombin light chain
Type:
Protein
Mol. Mass.:
70029.57
Organism:
Homo sapiens (Human)
Description:
P00734
Residue:
622
  
Inhibitor
Name:
BDBM50073429
Synonyms:
CHEMBL82032 N-((S)-1-Carbamimidoyl-2-hydroxy-piperidin-3-yl)-2-((S)-2-oxo-3-phenylmethanesulfonylamino-azepan-1-yl)-acetamide
Type:
Small organic molecule
Emp. Form.:
C21H32N6O5S
Mol. Mass.:
480.581
SMILES:
NC(=N)N1CCC[C@H](NC(=O)CN2CCCC[C@H](NS(=O)(=O)Cc3ccccc3)C2=O)C1O
: