Target
Peroxisome proliferator-activated receptor gamma
Ligand
BDBM28701
Substrate
Meas. Tech.
ChEMBL_154055 (CHEMBL761026)
EC50
60000±n/a nM
Citation
 Brown, PJWinegar, DAPlunket, KDMoore, LBLewis, MCWilson, JGSundseth, SSKoble, CSWu, ZChapman, JMLehmann, JMKliewer, SAWillson, TM A ureido-thioisobutyric acid (GW9578) is a subtype-selective PPARalpha agonist with potent lipid-lowering activity. J Med Chem 42:3785-8 (1999)  
Target
Name:
Peroxisome proliferator-activated receptor gamma
Synonyms:
NR1C3 PPAR-gamma PPARG_HUMAN Peroxisome proliferator-activated receptor gamma (PPAR gamma) Peroxisome proliferator-activated receptor gamma (PPARĪ³) peroxisome proliferator-activated receptor gamma isoform 2
Type:
Nuclear Receptor
Mol. Mass.:
57613.46
Organism:
Homo sapiens (Human)
Description:
P37231
Residue:
505
  
Inhibitor
Name:
BDBM28701
Synonyms:
2-(4-{2-[(4-chlorophenyl)formamido]ethyl}phenoxy)-2-methylpropanoic acid Bezafibrate Cedur | Sklerofibrat
Type:
Small organic molecule
Emp. Form.:
C19H20ClNO4
Mol. Mass.:
361.819
SMILES:
CC(C)(Oc1ccc(CCNC(=O)c2ccc(Cl)cc2)cc1)C(O)=O
: