Target
Lysophosphatidylserine lipase ABHD12
Ligand
BDBM50526088
Substrate
Meas. Tech.
ChEMBL_1899079 (CHEMBL4401194)
IC50
25±n/a nM
Citation
 Ogasawara, DIchu, TAJing, HHulce, JJReed, AUlanovskaya, OACravatt, BF Discovery and Optimization of Selective and in Vivo Active Inhibitors of the Lysophosphatidylserine Lipase ?/?-Hydrolase Domain-Containing 12 (ABHD12). J Med Chem 62:1643-1656 (2019)  
Target
Name:
Lysophosphatidylserine lipase ABHD12
Synonyms:
ABD12_MOUSE Monoacylglycerol lipase ABHD12
Type:
PROTEIN
Mol. Mass.:
45284.87
Organism:
Mus musculus
Description:
ChEMBL_643596
Residue:
398
  
Inhibitor
Name:
BDBM50526088
Synonyms:
CHEMBL4567616
Type:
Small organic molecule
Emp. Form.:
C23H21ClF3N5O2S
Mol. Mass.:
523.958
SMILES:
FC(F)(F)Oc1ccc(Oc2ccnc(N3CCC(CC3)NC(=S)Nc3cccnc3)c2Cl)cc1
: