Target
Histone deacetylase 6
Ligand
BDBM50526157
Substrate
Meas. Tech.
ChEMBL_1899196 (CHEMBL4401311)
IC50
<0.170000±n/a nM
Citation
 Amin, SAAdhikari, NKotagiri, SJha, TGhosh, B Histone deacetylase 3 inhibitors in learning and memory processes with special emphasis on benzamides. Eur J Med Chem 166:369-380 (2019)  
Target
Name:
Histone deacetylase 6
Synonyms:
Cereblon/Histone deacetylase 6 HDAC6 Histone deacetylase 6 (HDAC6) KIAA0901 | ORF Names:JM21
Type:
Chromatin regulator; hydrolase; repressor
Mol. Mass.:
131381.51
Organism:
Homo sapiens (Human)
Description:
Q9UBN7
Residue:
1215
  
Inhibitor
Name:
BDBM50526157
Synonyms:
CHEMBL4550526
Type:
Small organic molecule
Emp. Form.:
C21H28N4O5S
Mol. Mass.:
448.536
SMILES:
CC(C)(C)OC(=O)Nc1cccc(c1)-c1csc(NC(=O)CCCCCC(=O)NO)n1
: