Target
Amine oxidase [flavin-containing] A
Ligand
BDBM11022
Substrate
Meas. Tech.
ChEMBL_1899846 (CHEMBL4401961)
IC50
>500000±n/a nM
Citation
 Cheng, KLi, SLv, XTian, YKong, HHuang, XDuan, YHan, JXie, ZLiao, C Design, synthesis and biological evaluation of novel human monoamine oxidase B inhibitors based on a fragment in an X-ray crystal structure. Bioorg Med Chem Lett 29:1012-1018 (2019)  
Target
Name:
Amine oxidase [flavin-containing] A
Synonyms:
AOFA_HUMAN MAO-A Monoamine oxidase Monoamine oxidase type A (MAO A) Monoamine oxidase type A (MAOA)
Type:
Protein
Mol. Mass.:
59689.53
Organism:
Homo sapiens (Human)
Description:
P21397
Residue:
527
  
Inhibitor
Name:
BDBM11022
Synonyms:
2,3-dihydro-1H-indole-2,3-dione Isatin | Isatin (Compound 1)
Type:
Small organic molecule
Emp. Form.:
C8H5NO2
Mol. Mass.:
147.1308
SMILES:
O=C1Nc2ccccc2C1=O
: