Target
Polyphenol oxidase 2
Ligand
BDBM50526629
Substrate
Meas. Tech.
ChEMBL_1900395 (CHEMBL4402617)
Ki
1100±n/a nM
Citation
 Kim, JYKim, JYJenis, JLi, ZPBan, YJBaiseitova, APark, KH Tyrosinase inhibitory study of flavonolignans from the seeds of Silybum marianum (Milk thistle). Bioorg Med Chem 27:2499-2507 (2019)  
Target
Name:
Polyphenol oxidase 2
Synonyms:
Monophenol monooxygenase PPO2 Tyrosinase
Type:
Protein
Mol. Mass.:
63923.66
Organism:
Agaricus bisporus (Common mushroom)
Description:
O42713
Residue:
556
  
Inhibitor
Name:
BDBM50526629
Synonyms:
ISOSILYBIN A
Type:
Small organic molecule
Emp. Form.:
C25H22O10
Mol. Mass.:
482.4362
SMILES:
COc1cc(ccc1O)[C@H]1Oc2ccc(cc2O[C@@H]1CO)[C@H]1Oc2cc(O)cc(O)c2C(=O)[C@@H]1O
: