Target
Beta-2 adrenergic receptor
Ligand
BDBM50526679
Substrate
Meas. Tech.
ChEMBL_1900546 (CHEMBL4402768)
Ki
0.073000±n/a nM
Citation
 Schwalbe, THuebner, HGmeiner, P Development of covalent antagonists for ?1- and ?2-adrenergic receptors. Bioorg Med Chem 27:2959-2971 (2019)  
Target
Name:
Beta-2 adrenergic receptor
Synonyms:
ADRB2 ADRB2_HUMAN Beta-2 adrenoceptor | Beta-2 adrenoreceptor
Type:
Mol. Mass.:
46461.69
Organism:
Homo sapiens (Human)
Description:
P07550
Residue:
413
  
Inhibitor
Name:
BDBM50526679
Synonyms:
CHEMBL4456301
Type:
Small organic molecule
Emp. Form.:
C27H36N2O4S2
Mol. Mass.:
516.716
SMILES:
COc1cc(CCNC[C@H](O)COc2cccc3ccccc23)ccc1OCCCSSCCN
: