Target
Beta-2 adrenergic receptor
Ligand
BDBM25761
Substrate
Meas. Tech.
ChEMBL_1900546 (CHEMBL4402768)
Ki
0.320000±n/a nM
Citation
 Schwalbe, THuebner, HGmeiner, P Development of covalent antagonists for ?1- and ?2-adrenergic receptors. Bioorg Med Chem 27:2959-2971 (2019)  
Target
Name:
Beta-2 adrenergic receptor
Synonyms:
ADRB2 ADRB2_HUMAN Beta-2 adrenoceptor | Beta-2 adrenoreceptor
Type:
Mol. Mass.:
46461.69
Organism:
Homo sapiens (Human)
Description:
P07550
Residue:
413
  
Inhibitor
Name:
BDBM25761
Synonyms:
Anapriline CHEMBL27 PROPRANOLOL, d PROPRANOLOL,(+) Propanolol Propranolol | [2-hydroxy-3-(naphthalen-1-yloxy)propyl](propan-2-yl)amine
Type:
Small organic molecule
Emp. Form.:
C16H21NO2
Mol. Mass.:
259.3434
SMILES:
CC(C)NCC(O)COc1cccc2ccccc12
: