Target
3-phosphoinositide-dependent protein kinase 1
Ligand
BDBM50526694
Substrate
Meas. Tech.
ChEMBL_1900684 (CHEMBL4402906)
Kd
1500±n/a nM
Citation
 Yueh, CRettenmaier, JXia, BHall, DRAlekseenko, APorter, KABarkovich, KKeseru, GWhitty, AWells, JAVajda, SKozakov, D Kinase Atlas: Druggability Analysis of Potential Allosteric Sites in Kinases. J Med Chem 62:6512-6524 (2019)  
Target
Name:
3-phosphoinositide-dependent protein kinase 1
Synonyms:
3-Phosphoinositide-Dependent Protein Kinase 1 (PDK1) 3-phosphoinositide-dependent protein kinase 1 3-phosphoinositide-dependent protein kinase 1 (PDK-1) Isoform 2 of 3-phosphoinositide-dependent protein kinase 1 PDPK1 Phosphoinositide-dependent protein kinase 1 (PDK1) hPDK1
Type:
Enzyme
Mol. Mass.:
63157.65
Organism:
Homo sapiens (Human)
Description:
O15530
Residue:
556
  
Inhibitor
Name:
BDBM50526694
Synonyms:
CHEMBL4592040
Type:
Small organic molecule
Emp. Form.:
C15H9ClN2O2S3
Mol. Mass.:
380.892
SMILES:
Clc1ccc2nc(NS(=O)(=O)c3csc4ccccc34)sc2c1
: