Target
Proteasome subunit beta type-9
Ligand
BDBM50526811
Substrate
Meas. Tech.
ChEMBL_1901150 (CHEMBL4403372)
IC50
0.623000±n/a nM
Citation
 Xi, JZhuang, RKong, LHe, RZhu, HZhang, J Immunoproteasome-selective inhibitors: An overview of recent developments as potential drugs for hematologic malignancies and autoimmune diseases. Eur J Med Chem 182:0 (2019)  
Target
Name:
Proteasome subunit beta type-9
Synonyms:
LMP2 Macropain chain 7 PSB9_HUMAN PSMB9 Proteasome subunit beta-1i Really interesting new gene 12 protein
Type:
PROTEIN
Mol. Mass.:
23256.49
Organism:
Homo sapiens (Human)
Description:
ChEMBL_106197
Residue:
219
  
Inhibitor
Name:
BDBM50526811
Synonyms:
Kzr-616
Type:
Small organic molecule
Emp. Form.:
C30H42N4O8
Mol. Mass.:
586.6765
SMILES:
COc1ccc(cc1)[C@@H](O)[C@H](NC(=O)[C@H](C)NC(=O)CN1CCOCC1)C(=O)N[C@@H](CC1=CCCC1)C(=O)[C@@]1(C)CO1
: