Target
Delta-type opioid receptor
Ligand
BDBM50526891
Substrate
Meas. Tech.
ChEMBL_1901659 (CHEMBL4403881)
Ki
7.9±n/a nM
Citation
 Stefanucci, ADimmito, MPMacedonio, GCiarlo, LPieretti, SNovellino, ELei, WBarlow, DHouseknecht, KLStreicher, JMMollica, A Potent, Efficacious, and Stable Cyclic Opioid Peptides with Long Lasting Antinociceptive Effect after Peripheral Administration. J Med Chem 63:2673-2687 (2020)  
Target
Name:
Delta-type opioid receptor
Synonyms:
D-OR-1 Delta opioid receptor OPIATE Delta OPRD1 OPRK1 | opioid receptor, delta 1
Type:
G Protein-Coupled Receptor (GPCR)
Mol. Mass.:
40382.98
Organism:
Homo sapiens (Human)
Description:
Competition binding assays were carried out using membrane preparations from transfected HN9.10 cells that constitutively expressed the delta opioid receptor.
Residue:
372
  
Inhibitor
Name:
BDBM50526891
Synonyms:
CHEMBL4473632
Type:
Small organic molecule
Emp. Form.:
C62H68F8N10O14S2
Mol. Mass.:
1393.379
SMILES:
OC(=O)C(F)(F)F.OC(=O)C(F)(F)F.N[C@@H](Cc1ccc(O)cc1)C(=O)N[C@@H]1CSCc2ccccc2CSC[C@@H](NC(=O)[C@@H](N)Cc2ccc(O)cc2)C(=O)NCC(=O)N[C@@H](Cc2ccc(F)cc2)C(=O)N2CCN(CC2)C(=O)[C@H](Cc2ccc(F)cc2)NC(=O)CNC1=O
: