Target
GTPase KRas
Ligand
BDBM50527058
Substrate
Meas. Tech.
ChEMBL_1901970 (CHEMBL4404192)
IC50
52±n/a nM
Citation
 Kettle, JGBagal, SKBickerton, SBodnarchuk, MSBreed, JCarbajo, RJCassar, DJChakraborty, ACosulich, SCumming, IDavies, MEatherton, AEvans, LFeron, LFillery, SGleave, ESGoldberg, FWHarlfinger, SHanson, LHoward, MHowells, RJackson, AKemmitt, PKingston, JKLamont, SLewis, HJLi, SLiu, LOgg, DPhillips, CPolanski, RRobb, GRobinson, DRoss, SSmith, JMTonge, MWhiteley, RYang, JZhang, LZhao, X Structure-Based Design and Pharmacokinetic Optimization of Covalent Allosteric Inhibitors of the Mutant GTPase KRAS J Med Chem 63:4468-4483 (2020)  
Target
Name:
GTPase KRas
Synonyms:
GTPase KRas, N-terminally processed KRAS Ki-Ras RASK_HUMAN c-Ki-ras
Type:
PROTEIN
Mol. Mass.:
21656.10
Organism:
Homo sapiens (Human)
Description:
ChEMBL_1476955
Residue:
189
  
Inhibitor
Name:
BDBM50527058
Synonyms:
CHEMBL4455191
Type:
Small organic molecule
Emp. Form.:
C24H21ClFN3O3
Mol. Mass.:
453.893
SMILES:
[H][C@@]12COc3cnc4cc(c(Cl)cc4c3N1C[C@@H](C)N(C2)C(=O)C=C)-c1c(O)cccc1F
: