Target
Low affinity immunoglobulin epsilon Fc receptor
Ligand
BDBM50082216
Substrate
Meas. Tech.
ChEBML_88888
IC50
100±n/a nM
Citation
 Bailey, SBolognese, BFaller, ALouis-Flamberg, PMacPherson, DTMayer, RJMarshall, LAMilner, PHMistry, JSmith, DGWard, JG Selective inhibition of low affinity IgE receptor (CD23) processing: P1' bicyclomethyl substituents. Bioorg Med Chem Lett 9:3165-70 (1999)  
Target
Name:
Low affinity immunoglobulin epsilon Fc receptor
Synonyms:
BLAST-2 CD_antigen=CD23 FCE2 FCER2_HUMAN IGEBF Immunoglobulin epsilon Fc receptor Low affinity immunoglobulin epsilon Fc receptor membrane-bound form Lymphocyte IgE receptor
Type:
PROTEIN
Mol. Mass.:
36461.84
Organism:
Homo sapiens (Human)
Description:
ChEMBL_88888
Residue:
321
  
Inhibitor
Name:
BDBM50082216
Synonyms:
(2R,3S)-N*1*-((S)-1-Carbamoyl-2-phenyl-ethyl)-2-(7-fluoro-naphthalen-2-ylmethyl)-3,N*4*-dihydroxy-succinamide | CHEMBL110546
Type:
Small organic molecule
Emp. Form.:
C24H24FN3O5
Mol. Mass.:
453.4629
SMILES:
NC(=O)[C@H](Cc1ccccc1)NC(=O)[C@H](Cc1ccc2ccc(F)cc2c1)[C@H](O)C(=O)NO
: