Target
5'-nucleotidase
Ligand
BDBM50527132
Substrate
Meas. Tech.
ChEMBL_1902301 (CHEMBL4404523)
Ki
24±n/a nM
Citation
 Bhattarai, SPippel, JScaletti, EIdris, RFreundlieb, MRolshoven, GRenn, CLee, SYAbdelrahman, AZimmermann, HEl-Tayeb, AMüller, CESträter, N 2-Substituted ?,?-Methylene-ADP Derivatives: Potent Competitive Ecto-5'-nucleotidase (CD73) Inhibitors with Variable Binding Modes. J Med Chem 63:2941-2957 (2020)  
Target
Name:
5'-nucleotidase
Synonyms:
5'-NT 5NTD_HUMAN Ecto-5'-nucleotidase NT5 NTE
Type:
Enzyme
Mol. Mass.:
63371.54
Organism:
Homo sapiens (Human)
Description:
P21589
Residue:
574
  
Inhibitor
Name:
BDBM50527132
Synonyms:
CHEMBL4456465
Type:
Small organic molecule
Emp. Form.:
C11H16ClN5O9P2
Mol. Mass.:
459.673
SMILES:
Nc1nc(Cl)c2ncn([C@@H]3O[C@H](COP(O)(=O)CP(O)(O)=O)[C@@H](O)[C@H]3O)c2n1
: