Target
5'-nucleotidase
Ligand
BDBM50527138
Substrate
Meas. Tech.
ChEMBL_1902300 (CHEMBL4404522)
Ki
19±n/a nM
Citation
 Bhattarai, SPippel, JScaletti, EIdris, RFreundlieb, MRolshoven, GRenn, CLee, SYAbdelrahman, AZimmermann, HEl-Tayeb, AMüller, CESträter, N 2-Substituted ?,?-Methylene-ADP Derivatives: Potent Competitive Ecto-5'-nucleotidase (CD73) Inhibitors with Variable Binding Modes. J Med Chem 63:2941-2957 (2020)  
Target
Name:
5'-nucleotidase
Synonyms:
5'-nucleotidase Ecto-5'-nucleotidase (e5'NT) NT Nt5e | Nte
Type:
Enzyme
Mol. Mass.:
63971.44
Organism:
Rattus norvegicus (Rat)
Description:
P21588
Residue:
576
  
Inhibitor
Name:
BDBM50527138
Synonyms:
CHEMBL4475460
Type:
Small organic molecule
Emp. Form.:
C11H16ClN5O9P2
Mol. Mass.:
459.673
SMILES:
Nc1nc(Cl)nc2n(cnc12)[C@@H]1O[C@H](COP(O)(=O)CP(O)(O)=O)[C@@H](O)[C@H]1O
: