Target
5'-nucleotidase
Ligand
BDBM50527139
Substrate
Meas. Tech.
ChEMBL_1902301 (CHEMBL4404523)
Ki
16±n/a nM
Citation
 Bhattarai, SPippel, JScaletti, EIdris, RFreundlieb, MRolshoven, GRenn, CLee, SYAbdelrahman, AZimmermann, HEl-Tayeb, AMüller, CESträter, N 2-Substituted ?,?-Methylene-ADP Derivatives: Potent Competitive Ecto-5'-nucleotidase (CD73) Inhibitors with Variable Binding Modes. J Med Chem 63:2941-2957 (2020)  
Target
Name:
5'-nucleotidase
Synonyms:
5'-NT 5NTD_HUMAN Ecto-5'-nucleotidase NT5 NTE
Type:
Enzyme
Mol. Mass.:
63371.54
Organism:
Homo sapiens (Human)
Description:
P21589
Residue:
574
  
Inhibitor
Name:
BDBM50527139
Synonyms:
CHEMBL4591580
Type:
Small organic molecule
Emp. Form.:
C11H19N7O9P2
Mol. Mass.:
455.2576
SMILES:
NNc1nc(N)c2ncn([C@@H]3O[C@H](COP(O)(=O)CP(O)(O)=O)[C@@H](O)[C@H]3O)c2n1
: