Target
Integrase
Ligand
BDBM50527160
Substrate
Meas. Tech.
ChEMBL_1902393 (CHEMBL4404615)
Ki
4400±n/a nM
Citation
 Li, GMeanwell, NAKrystal, MRLangley, DRNaidu, BNSivaprakasam, PLewis, HKish, KKhan, JANg, ATrainor, GLCianci, CDicker, IBWalker, MALin, ZProtack, TDiscotto, LJenkins, SGerritz, SWPendri, A Discovery and Optimization of Novel Pyrazolopyrimidines as Potent and Orally Bioavailable Allosteric HIV-1 Integrase Inhibitors. J Med Chem 63:2620-2637 (2020)  
Target
Name:
Integrase
Synonyms:
pol
Type:
PROTEIN
Mol. Mass.:
32203.43
Organism:
Human immunodeficiency virus 1
Description:
ChEMBL_106649
Residue:
288
  
Inhibitor
Name:
BDBM50527160
Synonyms:
CHEMBL4475105
Type:
Small organic molecule
Emp. Form.:
C26H27N3O3
Mol. Mass.:
429.5109
SMILES:
Cc1cccc(c1)-c1c(C(OC(C)(C)C)C(O)=O)c(C)nc2cc(nn12)-c1ccccc1
: