Target
cAMP-specific 3',5'-cyclic phosphodiesterase 4D
Ligand
BDBM14774
Substrate
Meas. Tech.
ChEMBL_1902484 (CHEMBL4404706)
IC50
0.400000±n/a nM
Citation
 Liang, JHuang, YYZhou, QGao, YLi, ZWu, DYu, SGuo, LChen, ZHuang, LLiang, SHHe, XWu, RLuo, HB Discovery and Optimization of ?-Mangostin Derivatives as Novel PDE4 Inhibitors for the Treatment of Vascular Dementia. J Med Chem 63:3370-3380 (2020)  
Target
Name:
cAMP-specific 3',5'-cyclic phosphodiesterase 4D
Synonyms:
3',5'-cyclic phosphodiesterase PDE43 PDE4D_HUMAN | Phosphodiesterase 4D
Type:
Protein
Mol. Mass.:
91092.69
Organism:
Homo sapiens (Human)
Description:
Q08499
Residue:
809
  
Inhibitor
Name:
BDBM14774
Synonyms:
3-(cyclopropylmethoxy)-N-(3,5-dichloropyridin-4-yl)-4-(difluoromethoxy)benzamide DAXAS Roflumilast
Type:
Small organic molecule
Emp. Form.:
C17H14Cl2F2N2O3
Mol. Mass.:
403.207
SMILES:
FC(F)Oc1ccc(cc1OCC1CC1)C(=O)Nc1c(Cl)cncc1Cl
: