Target
D(2) dopamine receptor
Ligand
BDBM50116766
Substrate
Meas. Tech.
ChEMBL_1904308 (CHEMBL4406530)
Ki
4.7±n/a nM
Citation
 Moritz, AEFree, RBWeiner, WSAkano, EOGandhi, DAbramyan, AKeck, TMFerrer, MHu, XSouthall, NSteiner, JAubé, JShi, LFrankowski, KJSibley, DR Discovery, Optimization, and Characterization of ML417: A Novel and Highly Selective D J Med Chem 63:5526-5567 (2020)  
Target
Name:
D(2) dopamine receptor
Synonyms:
D(2) dopamine receptor DOPAMINE D2 Long DRD2 Dopamine D2 receptor Dopamine D2 receptor (D2R) Dopamine2-like | d2
Type:
Cell-surface receptors
Mol. Mass.:
50647.10
Organism:
Homo sapiens (Human)
Description:
P14416
Residue:
443
  
Inhibitor
Name:
BDBM50116766
Synonyms:
(-)-Pramipexole 2,6-Benzothiazolediamine, 4,5,6,7-tetrahydro-N(sup 6)-propyl-, (S)- PRAMIPEXOLE | cid_119570
Type:
Small organic molecule
Emp. Form.:
C10H17N3S
Mol. Mass.:
211.327
SMILES:
CCCN[C@H]1CCc2nc(N)sc2C1
: