Target
Alpha-2C adrenergic receptor
Ligand
BDBM50116766
Substrate
Meas. Tech.
ChEMBL_1904395 (CHEMBL4406617)
Ki
52±n/a nM
Citation
 Moritz, AEFree, RBWeiner, WSAkano, EOGandhi, DAbramyan, AKeck, TMFerrer, MHu, XSouthall, NSteiner, JAubé, JShi, LFrankowski, KJSibley, DR Discovery, Optimization, and Characterization of ML417: A Novel and Highly Selective D J Med Chem 63:5526-5567 (2020)  
Target
Name:
Alpha-2C adrenergic receptor
Synonyms:
ADA2C_HUMAN ADRA2L2 Adrenergic alpha2C Adrenergic receptor alpha Alpha-2 adrenergic receptor subtype C4 Alpha-2C adrenoreceptor | adrenergic, alpha-2C-, receptor [Homo sapiens]
Type:
Enzyme
Mol. Mass.:
49552.32
Organism:
Homo sapiens (Human)
Description:
P18825
Residue:
462
  
Inhibitor
Name:
BDBM50116766
Synonyms:
(-)-Pramipexole 2,6-Benzothiazolediamine, 4,5,6,7-tetrahydro-N(sup 6)-propyl-, (S)- PRAMIPEXOLE | cid_119570
Type:
Small organic molecule
Emp. Form.:
C10H17N3S
Mol. Mass.:
211.327
SMILES:
CCCN[C@H]1CCc2nc(N)sc2C1
: