Target
Alpha-1A adrenergic receptor
Ligand
BDBM50082825
Substrate
Meas. Tech.
ChEMBL_33740 (CHEMBL647055)
Ki
0.1±n/a nM
Citation
 Murali Dhar, TGNagarathnam, DMarzabadi, MRLagu, BWong, WCChiu, GTyagarajan, SMiao, SWZhang, FSun, WTian, DShen, QZhang, JWetzel, JMForray, CChang, RSBroten, TPSchorn, TWChen, TBO'Malley, SRansom, RSchneck, KBendesky, RHarrell, CMVyas, KP Design and synthesis of novel alpha(1)(a) adrenoceptor-selective antagonists. 2. Approaches to eliminate opioid agonist metabolites via modification of linker and 4-methoxycarbonyl-4-phenylpiperidine moiety. J Med Chem 42:4778-93 (1999)  
Target
Name:
Alpha-1A adrenergic receptor
Synonyms:
ADA1A_HUMAN ADRA1C Alpha 1A-adrenoceptor Alpha adrenergic receptor 1a Alpha-adrenergic receptor 1c adrenergic Alpha1 | adrenergic Alpha1C
Type:
Cell-surface receptors
Mol. Mass.:
51511.67
Organism:
Homo sapiens (Human)
Description:
P35348
Residue:
466
  
Inhibitor
Name:
BDBM50082825
Synonyms:
4-(3,4-Difluoro-phenyl)-3-[5-(4-methoxycarbonyl-4-phenyl-piperidin-1-yl)-pentyl]-6-methyl-2-oxo-1,2,3,4-tetrahydro-pyrimidine-5-carboxylic acid methyl ester | CHEMBL142981
Type:
Small organic molecule
Emp. Form.:
C31H37F2N3O5
Mol. Mass.:
569.6394
SMILES:
COC(=O)C1C(N(CCCCCN2CCC(CC2)(C(=O)OC)c2ccccc2)C(=O)N=C1C)c1ccc(F)c(F)c1
: