Target
DNA topoisomerase 1
Ligand
BDBM50083608
Substrate
Meas. Tech.
ChEBML_208413
EC50
55.0±n/a nM
Citation
 Ohkubo, MNishimura, THonma, TNishimura, IIto, SYoshinari, TSuda, HAMorishima, HNishimura, S Synthesis and biological activities of NB-506 analogues: Effects of the positions of two hydroxyl groups at the indole rings. Bioorg Med Chem Lett 9:3307-12 (2000)  
Target
Name:
DNA topoisomerase 1
Synonyms:
DNA topoisomerase I TOP1 | TOP1_HUMAN
Type:
Enzyme
Mol. Mass.:
90771.02
Organism:
Homo sapiens (Human)
Description:
P11387
Residue:
765
  
Inhibitor
Name:
BDBM50083608
Synonyms:
2,9-dihydroxy-6-(2-hydroxy-1-hydroxymethylethylamino)-12-(3,4,5-trihydroxy-6-hydroxymethyltetrahydro-2H-2-pyranyl)-6,7,12,13-tetrahydro-5H-indolo[2,3-a]pyrrolo[3,4-c]carbazole-5,7-dione | CHEMBL433841
Type:
Small organic molecule
Emp. Form.:
C29H28N4O11
Mol. Mass.:
608.5528
SMILES:
OCC(CO)NN1C(=O)c2c(C1=O)c1c3cc(O)ccc3n(C3OC(CO)C(O)C(O)C3O)c1c1[nH]c3cc(O)ccc3c21
: