Target
Acetyl-CoA carboxylase 1
Ligand
BDBM50529222
Substrate
Meas. Tech.
ChEMBL_1908109 (CHEMBL4410467)
IC50
1.5±n/a nM
Citation
 Mizojiri, RAsano, MSasaki, MSatoh, YYamamoto, YSumi, HMaezaki, H The identification and pharmacological evaluation of potent, selective and orally available ACC1 inhibitor. Bioorg Med Chem Lett 29:0 (2019)  
Target
Name:
Acetyl-CoA carboxylase 1
Synonyms:
ACAC ACACA_HUMAN ACC1 Acetyl-CoA carboxylase 1 | Acetyl-CoA carboxylase 1 (ACC1)
Type:
Protein
Mol. Mass.:
265543.22
Organism:
Homo sapiens (Human)
Description:
Q13085
Residue:
2346
  
Inhibitor
Name:
BDBM50529222
Synonyms:
CHEMBL4528475
Type:
Small organic molecule
Emp. Form.:
C25H24N4O4
Mol. Mass.:
444.4825
SMILES:
CC(NC(N)=O)c1ccc2nc(oc2c1)-c1ccc(Oc2cccc(OCC3CC3)c2)nc1
: