Target
Urokinase-type plasminogen activator
Ligand
BDBM16173
Substrate
Meas. Tech.
ChEMBL_1908156 (CHEMBL4410514)
IC50
2400±n/a nM
Citation
 Buckley, BJMajed, HAboelela, AMinaei, EJiang, LFildes, KCheung, CYJohnson, DBachovchin, DCook, GMHuang, MRanson, MKelso, MJ 6-Substituted amiloride derivatives as inhibitors of the urokinase-type plasminogen activator for use in metastatic disease. Bioorg Med Chem Lett 29:0 (2019)  
Target
Name:
Urokinase-type plasminogen activator
Synonyms:
PLAU UROK_HUMAN Urokinase-type plasminogen activator (uPA) | Urokinase-type plasminogen activator/surface receptor
Type:
Enzyme
Mol. Mass.:
48528.62
Organism:
Homo sapiens (Human)
Description:
P00749
Residue:
431
  
Inhibitor
Name:
BDBM16173
Synonyms:
3,5-diamino-6-chloro-N-(diaminomethylene)pyrazinamide;hydrochloride Amiloride CHEMBL945
Type:
Small organic molecule
Emp. Form.:
C6H8ClN7O
Mol. Mass.:
229.627
SMILES:
NC(=N)NC(=O)c1nc(Cl)c(N)nc1N
: