Target
Plasma kallikrein
Ligand
BDBM16173
Substrate
Meas. Tech.
ChEMBL_1908155 (CHEMBL4410513)
IC50
>50000±n/a nM
Citation
 Buckley, BJMajed, HAboelela, AMinaei, EJiang, LFildes, KCheung, CYJohnson, DBachovchin, DCook, GMHuang, MRanson, MKelso, MJ 6-Substituted amiloride derivatives as inhibitors of the urokinase-type plasminogen activator for use in metastatic disease. Bioorg Med Chem Lett 29:0 (2019)  
Target
Name:
Plasma kallikrein
Synonyms:
Fletcher factor KLKB1 Kallikrein Plasma kallikrein heavy chain Plasma prekallikrein
Type:
Protein
Mol. Mass.:
71391.16
Organism:
Homo sapiens (Human)
Description:
P03952
Residue:
638
  
Inhibitor
Name:
BDBM16173
Synonyms:
3,5-diamino-6-chloro-N-(diaminomethylene)pyrazinamide;hydrochloride Amiloride CHEMBL945
Type:
Small organic molecule
Emp. Form.:
C6H8ClN7O
Mol. Mass.:
229.627
SMILES:
NC(=N)NC(=O)c1nc(Cl)c(N)nc1N
: