Target
Histamine H1 receptor
Ligand
BDBM50529278
Substrate
Meas. Tech.
ChEMBL_1908194 (CHEMBL4410552)
IC50
3.0±n/a nM
Citation
 Li, FXu, QZhu, QChu, ZLin, GMo, JZhao, YLi, JHe, GXu, Y Design, synthesis and biological evaluation of novel desloratadine derivatives with anti-inflammatory and H Bioorg Med Chem Lett 29:0 (2019)  
Target
Name:
Histamine H1 receptor
Synonyms:
H1R HISTAMINE H1 HRH1_HUMAN
Type:
G Protein-Coupled Receptor (GPCR)
Mol. Mass.:
55808.72
Organism:
Homo sapiens (Human)
Description:
Cell pellets from SK-N-MC cells transfected with human H1 receptor were used in binding assay.
Residue:
487
  
Inhibitor
Name:
BDBM50529278
Synonyms:
CHEMBL4446961
Type:
Small organic molecule
Emp. Form.:
C29H31ClN2O3
Mol. Mass.:
491.021
SMILES:
[#6]-[#8]-c1ccccc1-[#8]-[#6]-[#6](-[#8])-[#6]-[#7]-1-[#6]-[#6]\[#6](-[#6]-[#6]-1)=[#6]-1\c2ccc(Cl)cc2-[#6]-[#6]-c2cccnc-12
: