Target
Tyrosinase
Ligand
BDBM50174577
Substrate
Meas. Tech.
ChEMBL_1908905 (CHEMBL4411351)
IC50
1950±n/a nM
Citation
 Pillaiyar, TNamasivayam, VManickam, MJung, SH Inhibitors of Melanogenesis: An Updated Review. J Med Chem 61:7395-7418 (2018)  
Target
Name:
Tyrosinase
Synonyms:
LB24-AB SK29-AB TYRO_HUMAN | Tumor rejection antigen AB
Type:
Protein
Mol. Mass.:
60388.08
Organism:
Homo sapiens (Human)
Description:
P14679
Residue:
529
  
Inhibitor
Name:
BDBM50174577
Synonyms:
CHEMBL3810334
Type:
Small organic molecule
Emp. Form.:
C23H22N2O6
Mol. Mass.:
422.4306
SMILES:
Oc1c[nH]c(COC(=O)[C@H](Cc2ccccc2)NC(=O)OCc2ccccc2)cc1=O
: