Target
Tyrosinase
Ligand
BDBM50205806
Substrate
Meas. Tech.
ChEMBL_1908914 (CHEMBL4411360)
Ki
1200±n/a nM
Citation
 Pillaiyar, TNamasivayam, VManickam, MJung, SH Inhibitors of Melanogenesis: An Updated Review. J Med Chem 61:7395-7418 (2018)  
Target
Name:
Tyrosinase
Synonyms:
LB24-AB SK29-AB TYRO_HUMAN | Tumor rejection antigen AB
Type:
Protein
Mol. Mass.:
60388.08
Organism:
Homo sapiens (Human)
Description:
P14679
Residue:
529
  
Inhibitor
Name:
BDBM50205806
Synonyms:
CHEMBL3969839
Type:
Small organic molecule
Emp. Form.:
C14H9NO6
Mol. Mass.:
287.2244
SMILES:
Oc1cc2O\C(=C/c3ccc(=O)n(O)c3)C(=O)c2c(O)c1
: