Target
Retinoic acid receptor alpha
Ligand
BDBM50084836
Substrate
Meas. Tech.
ChEMBL_197402 (CHEMBL799793)
IC50
40±n/a nM
Citation
 Kikuchi, KHibi, SYoshimura, HTokuhara, NTai, KHida, TYamauchi, TNagai, M Syntheses and structure-activity relationships of 5,6,7, 8-tetrahydro-5,5,8,8-tetramethyl-2-quinoxaline derivatives with retinoic acid receptor alpha agonistic activity. J Med Chem 43:409-19 (2000)  
Target
Name:
Retinoic acid receptor alpha
Synonyms:
NR1B1 RAR-alpha RARA_HUMAN Retinoic acid receptor alpha/Retinoid X receptor alpha Retinoid receptor
Type:
PROTEIN
Mol. Mass.:
50778.87
Organism:
Homo sapiens (Human)
Description:
ChEMBL_1466191
Residue:
462
  
Inhibitor
Name:
BDBM50084836
Synonyms:
4-[(5,5,8,8-Tetramethyl-5,6,7,8-tetrahydro-quinoxaline-2-carbonyl)-amino]-benzoic acid | CHEMBL432592
Type:
Small organic molecule
Emp. Form.:
C20H23N3O3
Mol. Mass.:
353.4149
SMILES:
CC1(C)CCC(C)(C)c2nc(cnc12)C(=O)Nc1ccc(cc1)C(O)=O
: