Target
Retinoic acid receptor beta
Ligand
BDBM50084836
Substrate
Meas. Tech.
ChEMBL_195487 (CHEMBL798909)
IC50
140±n/a nM
Citation
 Kikuchi, KHibi, SYoshimura, HTokuhara, NTai, KHida, TYamauchi, TNagai, M Syntheses and structure-activity relationships of 5,6,7, 8-tetrahydro-5,5,8,8-tetramethyl-2-quinoxaline derivatives with retinoic acid receptor alpha agonistic activity. J Med Chem 43:409-19 (2000)  
Target
Name:
Retinoic acid receptor beta
Synonyms:
HAP NR1B2 RAR-beta RARB Retinoic acid receptor RXR-alpha/Retinoic acid receptor beta Retinoid receptor
Type:
PROTEIN
Mol. Mass.:
50498.70
Organism:
Homo sapiens (Human)
Description:
ChEMBL_1458015
Residue:
455
  
Inhibitor
Name:
BDBM50084836
Synonyms:
4-[(5,5,8,8-Tetramethyl-5,6,7,8-tetrahydro-quinoxaline-2-carbonyl)-amino]-benzoic acid | CHEMBL432592
Type:
Small organic molecule
Emp. Form.:
C20H23N3O3
Mol. Mass.:
353.4149
SMILES:
CC1(C)CCC(C)(C)c2nc(cnc12)C(=O)Nc1ccc(cc1)C(O)=O
: