Target
D(4) dopamine receptor
Ligand
BDBM50189854
Substrate
Meas. Tech.
ChEMBL_1912575 (CHEMBL4415158)
Ki
0.250000±n/a nM
Citation
 Vanda, DZajdel, PSoural, M Imidazopyridine-based selective and multifunctional ligands of biological targets associated with psychiatric and neurodegenerative diseases. Eur J Med Chem 181:0 (2019)  
Target
Name:
D(4) dopamine receptor
Synonyms:
D(2C) dopamine receptor DOPAMINE D4.2 DRD4 Dopamine D4 receptor
Type:
Enzyme
Mol. Mass.:
48373.19
Organism:
Homo sapiens (Human)
Description:
P21917
Residue:
419
  
Inhibitor
Name:
BDBM50189854
Synonyms:
6-bromo-2-[4-(2-methoxyphenyl)piperazin-1-ylmethyl]imidazo[1,2-a]pyridine | CHEMBL211164
Type:
Small organic molecule
Emp. Form.:
C19H21BrN4O
Mol. Mass.:
401.3
SMILES:
COc1ccccc1N1CCN(Cc2cn3cc(Br)ccc3n2)CC1
: