Target
Tyrosyl-DNA phosphodiesterase 1
Ligand
BDBM50530462
Substrate
Meas. Tech.
ChEMBL_1912627 (CHEMBL4415210)
IC50
100±n/a nM
Citation
 Kovaleva, KOleshko, OMamontova, EYarovaya, OZakharova, OZakharenko, AKononova, ADyrkheeva, NCheresiz, SPokrovsky, ALavrik, OSalakhutdinov, N Dehydroabietylamine Ureas and Thioureas as Tyrosyl-DNA Phosphodiesterase 1 Inhibitors That Enhance the Antitumor Effect of Temozolomide on Glioblastoma Cells. J Nat Prod 82:2443-2450 (2019)  
Target
Name:
Tyrosyl-DNA phosphodiesterase 1
Synonyms:
TDP1 Tyrosyl-DNA phosphodiesterase 1 | Tyrosyl-DNA phosphodiesterase 1 (TDP1)
Type:
Enzyme
Mol. Mass.:
68430.66
Organism:
Homo sapiens (Human)
Description:
Q9NUW8
Residue:
608
  
Inhibitor
Name:
BDBM50530462
Synonyms:
CHEMBL4435210
Type:
Small organic molecule
Emp. Form.:
C31H46N2O
Mol. Mass.:
462.7097
SMILES:
[H][C@@]12CCc3cc(ccc3[C@@]1(C)CCC[C@@]2(C)CNC(=O)NC12CC3CC(CC(C3)C1)C2)C(C)C
: