Target
Polyunsaturated fatty acid lipoxygenase ALOX15B
Ligand
BDBM50241955
Substrate
Meas. Tech.
ChEMBL_1914743 (CHEMBL4417326)
IC50
>40000±n/a nM
Citation
 Vo, NNQNomura, YMuranaka, TFukushima, EO Structure-Activity Relationships of Pentacyclic Triterpenoids as Inhibitors of Cyclooxygenase and Lipoxygenase Enzymes. J Nat Prod 82:3311-3320 (2019)  
Target
Name:
Polyunsaturated fatty acid lipoxygenase ALOX15B
Synonyms:
15-LOX-2 15-Lipoxygenase-2 (15-LOX-2) ALOX15B Arachidonate 15-lipoxygenase, type II Epithelial 15-lipoxygenase-2 | LX15B_HUMAN
Type:
Protein
Mol. Mass.:
75850.40
Organism:
Homo sapiens (Human)
Description:
Residue:
676
  
Inhibitor
Name:
BDBM50241955
Synonyms:
3beta-hydroxyolean-12-ene Germanicol | beta-amyrin
Type:
Small organic molecule
Emp. Form.:
C30H50O
Mol. Mass.:
426.7174
SMILES:
CC1(C)CC[C@]2(C)CC[C@]3(C)C(=CC[C@@H]4[C@@]5(C)CC[C@H](O)C(C)(C)[C@@H]5CC[C@@]34C)[C@@H]2C1
: