Target
Proto-oncogene tyrosine-protein kinase Src
Ligand
BDBM50086683
Substrate
Meas. Tech.
ChEBML_221661
IC50
150000±n/a nM
Citation
 Marsilje, THMilkiewicz, KLHangauer, DG The design, synthesis and activity of non-ATP competitive inhibitors of pp60(c-src) tyrosine kinase. Part 1: hydroxynaphthalene derivatives. Bioorg Med Chem Lett 10:477-81 (2000)  
Target
Name:
Proto-oncogene tyrosine-protein kinase Src
Synonyms:
Calmodulin/Proto-oncogene tyrosine-protein kinase Src Proto-oncogene c-Src SRC SRC_HUMAN V-src sarcoma (Schmidt-Ruppin A-2) viral oncogene homolog (avian) p60-Src | pp60c-src
Type:
Protein
Mol. Mass.:
59838.60
Organism:
Homo sapiens (Human)
Description:
P12931
Residue:
536
  
Inhibitor
Name:
BDBM50086683
Synonyms:
3,5-Dihydroxy-naphthalene-2-carboxylic acid (3-hydroxy-phenyl)-amide | CHEMBL145229
Type:
Small organic molecule
Emp. Form.:
C17H13NO4
Mol. Mass.:
295.2894
SMILES:
Oc1cccc(NC(=O)c2cc3cccc(O)c3cc2O)c1
: