Target
Cytochrome P450 1A2
Ligand
BDBM50531422
Substrate
Meas. Tech.
ChEMBL_1920111 (CHEMBL4422956)
IC50
>20000±n/a nM
Citation
 Härter, MKalthof, BDelbeck, MLustig, KGerisch, MSchulz, SKast, RMeibom, DLindner, N Novel non-xanthine antagonist of the A Eur J Med Chem 163:763-778 (2019)  
Target
Name:
Cytochrome P450 1A2
Synonyms:
CP1A2_HUMAN CYPIA2 Cytochrome P(3)450 Cytochrome P450 1A2 (CYP1A2) Cytochrome P450-P3
Type:
Enzyme
Mol. Mass.:
58423.38
Organism:
Homo sapiens (Human)
Description:
P05177
Residue:
516
  
Inhibitor
Name:
BDBM50531422
Synonyms:
CHEMBL4522981
Type:
Small organic molecule
Emp. Form.:
C18H22F3N3O4S
Mol. Mass.:
433.445
SMILES:
CCn1c(=O)n(CCC(F)(F)F)c2sc(C(=O)N3CCC(O)CC3)c(C)c2c1=O
: