Target
Adenosine receptor A1
Ligand
BDBM50531422
Substrate
Meas. Tech.
ChEMBL_1920185 (CHEMBL4423030)
IC50
>6700±n/a nM
Citation
 Härter, MKalthof, BDelbeck, MLustig, KGerisch, MSchulz, SKast, RMeibom, DLindner, N Novel non-xanthine antagonist of the A Eur J Med Chem 163:763-778 (2019)  
Target
Name:
Adenosine receptor A1
Synonyms:
AA1R_MOUSE Adenosine receptor A1 | Adora1
Type:
PROTEIN
Mol. Mass.:
36646.06
Organism:
Mus musculus
Description:
ChEMBL_479902
Residue:
326
  
Inhibitor
Name:
BDBM50531422
Synonyms:
CHEMBL4522981
Type:
Small organic molecule
Emp. Form.:
C18H22F3N3O4S
Mol. Mass.:
433.445
SMILES:
CCn1c(=O)n(CCC(F)(F)F)c2sc(C(=O)N3CCC(O)CC3)c(C)c2c1=O
: