Target
Adenosine receptor A2b
Ligand
BDBM50531422
Substrate
Meas. Tech.
ChEMBL_1920191 (CHEMBL4423036)
IC50
280±n/a nM
Citation
 Härter, MKalthof, BDelbeck, MLustig, KGerisch, MSchulz, SKast, RMeibom, DLindner, N Novel non-xanthine antagonist of the A Eur J Med Chem 163:763-778 (2019)  
Target
Name:
Adenosine receptor A2b
Synonyms:
AA2BR_RAT Adora2b
Type:
PROTEIN
Mol. Mass.:
36378.84
Organism:
Rattus norvegicus
Description:
ChEMBL_32934
Residue:
332
  
Inhibitor
Name:
BDBM50531422
Synonyms:
CHEMBL4522981
Type:
Small organic molecule
Emp. Form.:
C18H22F3N3O4S
Mol. Mass.:
433.445
SMILES:
CCn1c(=O)n(CCC(F)(F)F)c2sc(C(=O)N3CCC(O)CC3)c(C)c2c1=O
: