Target
Alpha-1D adrenergic receptor
Ligand
BDBM50087484
Substrate
Meas. Tech.
ChEMBL_30104 (CHEMBL642031)
Ki
0.61±n/a nM
Citation
 Meyer, MDAltenbach, RJBasha, FZCarroll, WACondon, SElmore, SWKerwin, JFSippy, KBTietje, KWendt, MDHancock, AABrune, MEBuckner, SADrizin, I Structure-activity studies for a novel series of tricyclic substituted hexahydrobenz[e]isoindole alpha(1A) adrenoceptor antagonists as potential agents for the symptomatic treatment of benign prostatic hyperplasia (BPH). J Med Chem 43:1586-603 (2000)  
Target
Name:
Alpha-1D adrenergic receptor
Synonyms:
ADA1D_RAT Adra1d Alpha-1D adrenergic receptor | Serotonin 1a (5-HT1a) receptor/Adrenergic receptor alpha-1
Type:
Protein
Mol. Mass.:
59375.97
Organism:
Rattus norvegicus (Rat)
Description:
P23944
Residue:
561
  
Inhibitor
Name:
BDBM50087484
Synonyms:
6-Chloro-2-[2-(6-methoxy-1,3,3a,4,5,9b-hexahydro-benzo[e]isoindol-2-yl)-ethyl]-4H-9-thia-2,4,5-triaza-fluorene-1,3-dione | CHEMBL295741
Type:
Small organic molecule
Emp. Form.:
C24H23ClN4O3S
Mol. Mass.:
482.982
SMILES:
COc1cccc2[C@@H]3CN(CCn4c(=O)[nH]c5c6nc(Cl)ccc6sc5c4=O)C[C@@H]3CCc12
: