Target
Potassium voltage-gated channel subfamily H member 2
Ligand
BDBM50531908
Substrate
Meas. Tech.
ChEMBL_1921440 (CHEMBL4424285)
IC50
1.000000±n/a nM
Citation
 Guerrero, MUrbano, MKim, EKGamo, AMRiley, SAbgaryan, LLeaf, NVan Orden, LJBrown, SJXie, JYPorreca, FCameron, MDRosen, HRoberts, E Design and Synthesis of a Novel and Selective Kappa Opioid Receptor (KOR) Antagonist (BTRX-335140). J Med Chem 62:1761-1780 (2019)  
Target
Name:
Potassium voltage-gated channel subfamily H member 2
Synonyms:
1,3-beta-glucan synthase component GLS2 ERG Eag-related protein 1 Ether-a-go-go-related gene (HERG) Ether-a-go-go-related gene potassium channel 1 Ether-a-go-go-related gene potassium channel 1 (hERG1) Ether-a-go-go-related protein 1 H-ERG KCNH2 Potassium voltage-gated channel subfamily H member 2 (hERG) Voltage-gated potassium channel subunit Kv11.1 hERG Potassium Channel 1 | putative potassium channel subunit
Type:
Multi-pass membrane protein
Mol. Mass.:
126672.65
Organism:
Homo sapiens (Human)
Description:
Q12809
Residue:
1159
  
Inhibitor
Name:
BDBM50531908
Synonyms:
Btrx-335140 US10676469, Compound 142 | US11124504, Cpd. No. 142
Type:
Small organic molecule
Emp. Form.:
C25H32FN5O2
Mol. Mass.:
453.5523
SMILES:
CCc1cc(F)c2nc(N3CCC(CC3)NC3CCOCC3)c(-c3nc(C)no3)c(C)c2c1
: