Target
Coagulation factor X
Ligand
BDBM50087637
Substrate
Meas. Tech.
ChEBML_48807
IC50
2.1±n/a nM
Citation
 Tamura, SYLevy, OEUong, THReiner, JEGoldman, EAHo, JZCohen, CRBergum, PWNutt, RFBrunck, TKSemple, JE Guanylpiperidine peptidomimetics: potent and selective bis-cation inhibitors of factor Xa. Bioorg Med Chem Lett 10:745-9 (2000)  
Target
Name:
Coagulation factor X
Synonyms:
Activated coagulation factor X (FXa) Coagulation factor X precursor F10 Factor X heavy chain Factor Xa Stuart-Prower factor
Type:
Enzyme
Mol. Mass.:
54726.60
Organism:
Homo sapiens (Human)
Description:
Residue:
488
  
Inhibitor
Name:
BDBM50087637
Synonyms:
2-{[(R)-1-{[((S)-1-Carbamimidoyl-2-hydroxy-piperidin-3-ylcarbamoyl)-methyl]-carbamoyl}-2-(1-carbamimidoyl-piperidin-3-yl)-ethylsulfamoyl]-methyl}-benzoic acid; TFA | CHEMBL435448
Type:
Small organic molecule
Emp. Form.:
C25H39N9O7S
Mol. Mass.:
609.698
SMILES:
NC(=N)N1CCCC(C[C@@H](NS(=O)(=O)Cc2ccccc2C(O)=O)C(=O)NCC(=O)N[C@H]2CCCN(C2O)C(N)=N)C1
: