Target
Coagulation factor X
Ligand
BDBM50087639
Substrate
Meas. Tech.
ChEMBL_48803 (CHEMBL662828)
Ki
23±n/a nM
Citation
 Tamura, SYLevy, OEUong, THReiner, JEGoldman, EAHo, JZCohen, CRBergum, PWNutt, RFBrunck, TKSemple, JE Guanylpiperidine peptidomimetics: potent and selective bis-cation inhibitors of factor Xa. Bioorg Med Chem Lett 10:745-9 (2000)  
Target
Name:
Coagulation factor X
Synonyms:
Activated coagulation factor X (FXa) Coagulation factor X precursor F10 Factor X heavy chain Factor Xa Stuart-Prower factor
Type:
Enzyme
Mol. Mass.:
54726.60
Organism:
Homo sapiens (Human)
Description:
Residue:
488
  
Inhibitor
Name:
BDBM50087639
Synonyms:
(R)-N-[((S)-1-Carbamimidoyl-2-hydroxy-piperidin-3-ylcarbamoyl)-methyl]-3-(1-carbamimidoyl-piperidin-4-yl)-2-(2-tetrazol-1-yl-phenylmethanesulfonylamino)-propionamide; TFA | CHEMBL164419
Type:
Small organic molecule
Emp. Form.:
C25H39N13O5S
Mol. Mass.:
633.726
SMILES:
NC(=N)N1CCC(C[C@@H](NS(=O)(=O)Cc2ccccc2-n2cnnn2)C(=O)NCC(=O)N[C@H]2CCCN(C2O)C(N)=N)CC1
: