Target
Carbonic anhydrase 9
Ligand
BDBM50532057
Substrate
Meas. Tech.
ChEMBL_1921829 (CHEMBL4424674)
Ki
260±n/a nM
Citation
 Andring, JTDohle, WTu, CPotter, BVLMcKenna, R 3,17?-Bis-sulfamoyloxy-2-methoxyestra-1,3,5(10)-triene and Nonsteroidal Sulfamate Derivatives Inhibit Carbonic Anhydrase IX: Structure-Activity Optimization for Isoform Selectivity. J Med Chem 62:2202-2212 (2019)  
Target
Name:
Carbonic anhydrase 9
Synonyms:
CA-IX CAH9_HUMAN Carbonic anhydrase 9 (CA IX) Carbonic anhydrase 9 precursor Carbonic anhydrase IX (CAIX) Carbonic anhydrases; II & IX MN RCC-associated antigen G250
Type:
Enzyme
Mol. Mass.:
49669.03
Organism:
Homo sapiens (Human)
Description:
Catalytic domain of human cloned isozyme was used in the assay
Residue:
459
  
Inhibitor
Name:
BDBM50532057
Synonyms:
CHEMBL4550943
Type:
Small organic molecule
Emp. Form.:
C19H23ClN2O5S
Mol. Mass.:
426.914
SMILES:
COc1ccc(Cl)c(CN2Cc3cc(OC)c(OS(N)(=O)=O)cc3CC2C)c1
: