Target
Beta-2 adrenergic receptor
Ligand
BDBM81499
Substrate
Meas. Tech.
ChEMBL_1923009 (CHEMBL4425965)
Kd
0.700000±n/a nM
Citation
 Dickson, CJHornak, VVelez-Vega, CMcKay, DJReilly, JSandham, DAShaw, DFairhurst, RACharlton, SJSykes, DAPearlstein, RADuca, JS Uncoupling the Structure-Activity Relationships of ?2 Adrenergic Receptor Ligands from Membrane Binding. J Med Chem 59:5780-9 (2016)  
Target
Name:
Beta-2 adrenergic receptor
Synonyms:
ADRB2 ADRB2_HUMAN Beta-2 adrenoceptor | Beta-2 adrenoreceptor
Type:
Mol. Mass.:
46461.69
Organism:
Homo sapiens (Human)
Description:
P07550
Residue:
413
  
Inhibitor
Name:
BDBM81499
Synonyms:
CAS_155346 CYANOPINDOLOL(+/-) | NSC_155346
Type:
Small organic molecule
Emp. Form.:
C16H21N3O2
Mol. Mass.:
287.3568
SMILES:
CC(C)(C)NCC(O)COc1cccc2[nH]c(cc12)C#N
: