Target
Histone-arginine methyltransferase CARM1
Ligand
BDBM50532879
Substrate
Meas. Tech.
ChEMBL_1924029 (CHEMBL4426985)
IC50
27±n/a nM
Citation
 Ferreira de Freitas, REram, MSSmil, DSzewczyk, MMKennedy, SBrown, PJSanthakumar, VBarsyte-Lovejoy, DArrowsmith, CHVedadi, MSchapira, M Discovery of a Potent and Selective Coactivator Associated Arginine Methyltransferase 1 (CARM1) Inhibitor by Virtual Screening. J Med Chem 59:6838-47 (2016)  
Target
Name:
Histone-arginine methyltransferase CARM1
Synonyms:
CARM1 Coactivator-associated arginine methyltransferase 1 PRMT4 Protein arginine methyltransferase 4 (PRMT4)
Type:
Protein
Mol. Mass.:
65855.47
Organism:
Homo sapiens (Human)
Description:
Q86X55
Residue:
608
  
Inhibitor
Name:
BDBM50532879
Synonyms:
CHEMBL3347611
Type:
Small organic molecule
Emp. Form.:
C24H20F3N7O2
Mol. Mass.:
495.4565
SMILES:
C[C@H](N)C(=O)NCc1cccc(c1)-n1nc(cc1-c1nnc(o1)-c1cccc2[nH]ccc12)C(F)(F)F
: